{"text_format":"1","workbook":"xlsx","n_sheets":8,"sheets":["Beregning","Lister","Data2","Data","Endring","Ferskvann","Fjord","Hav"],"not_rendered":{"charts":0,"images":1,"macros":1,"external_links":0,"defined_names":5,"comments":0,"pivot_tables":0},"unopened":[],"bounds":{"document_bytes":16777216,"sheet_cells":100000,"rows_first":2000,"rows_last":500,"rows_between":2000,"halvings":0,"cell_chars":16384,"cell_head_chars":4096},"cells_cut":0,"cells_raw":0,"read":"whole","date_system":"1900"}

{"sheet":"Beregning","index":0,"n_rows":13,"n_cols":11,"rows_kept":13,"cut":false,"hidden":false,"merged":[[15,1,15,8],[12,2,12,3],[12,4,12,5],[17,1,17,8],[24,1,24,6],[23,1,23,8],[18,1,18,8],[19,1,19,8],[20,1,20,8],[22,1,22,8],[5,4,5,5],[6,4,6,5],[2,2,2,5],[5,2,5,3],[6,2,6,3],[7,4,7,5],[11,2,11,3],[11,4,11,5],[9,2,9,3],[9,4,9,5],[10,2,10,3],[10,4,10,5],[7,2,7,3],[8,2,8,3],[8,4,8,5]]}
[]
[null,null,null,null,null,null,null,null,null,null,"Revidert: 27.06.25"]
[]
[]
[]
[null,null,"Luftfyllingsgrad i %"]
[null,null,"SDR klasse",null,7.4]
[null,null,"Dim ledning",null,"900mm - 1850kg  boltefritt lodd"]
[null,null,"Vannforhold"]
[null,null,"Lengde"]
{"$rows_left_out":4}
{"sheet":"Lister","index":1,"n_rows":33,"n_cols":17,"rows_kept":33,"cut":false,"hidden":true,"merged":[]}
[]
[]
[null,null,"Ferskvann"]
[null,null,"Fjord",null,null,null,null,"32mm - 4kg stripselodd ",null,null,null,null,7.4,null,null,null,{"$f":"Beregning!E9","v":0}]
[null,null,"Hav",null,null,null,null,"40mm - 4kg stripselodd",null,null,null,null,9]
[null,null,null,null,null,null,null,"40mm - 8,5kg stripselodd",null,null,null,null,11]
[null,null,null,null,null,null,null,"50mm - 4kg stripselodd",null,null,null,null,13.6]
[null,null,null,null,null,null,null,"50mm - 8,5kg stripselodd",null,null,null,null,17]
[null,null,null,null,null,null,null,"63mm - 4kg stripselodd",null,null,null,null,21]
[null,null,null,null,null,null,null,"63mm - 8,5kg stripselodd",null,null,null,null,26]
{"$rows_left_out":24}
{"sheet":"Data2","index":2,"n_rows":57,"n_cols":17,"rows_kept":57,"cut":false,"hidden":false,"merged":[[0,15,0,16],[0,13,0,14],[0,5,0,6],[0,7,0,8],[40,4,40,5],[0,3,0,4],[39,4,39,5],[0,9,0,10],[0,11,0,12],[56,0,57,14],[52,0,52,14],[41,4,41,5],[42,4,42,5],[54,3,54,13],[55,3,55,13],[46,3,46,11]]}
[null,null,null,"SDR 26",null,"SDR 21",null,"SDR 17",null,"SDR 13,6",null,"SDR 11",null,"SDR 9",null,"SDR 7,4"]
[]
["Størrelse","vekt i kg"," ","Kg/m ","c/c","Kg/m ","c/c","Kg/m ","c/c","Kg/m ","c/c","Kg/m ","c/c","Kg/m ","c/c"]
[]
["32mm - 4kg stripselodd ",4,null,0,0,null,null,{"$f":"(Data!$G5+Beregning!$E$6*Data!$H5)","v":{"$error":"#REF!"}},{"$f":"(B5/H5)","v":{"$error":"#REF!"}},{"$f":"(Data!$I5+Beregning!$E$6*Data!$J5)","v":{"$error":"#REF!"}},{"$f":"(B5/J5)","v":{"$error":"#REF!"}},{"$f":"(Data!$K5+Beregning!$E$6*Data!$L5)","v":{"$error":"#REF!"}},{"$f":"(B5/L5)","v":{"$error":"#REF!"}},{"$f":"(Data!$M5+Beregning!$E$6*Data!$N5)","v":{"$error":"#REF!"}},{"$f":"(B5/N5)","v":{"$error":"#REF!"}},{"$f":"(Data!$O5+Beregning!$E$6*Data!$P5)","v":{"$error":"#REF!"}},{"$f":"(B5/P5)","v":{"$error":"#REF!"}}]
["40mm - 4kg stripselodd",4,null,null,null,null,null,{"$f":"(Data!$G6+Beregning!$E$6*Data!$H6)","v":{"$error":"#REF!"}},{"$error":"#REF!"},{"$f":"(Data!$I6+Beregning!$E$6*Data!$J6)","v":{"$error":"#REF!"}},{"$error":"#REF!"},{"$f":"(Data!$K6+Beregning!$E$6*Data!$L6)","v":{"$error":"#REF!"}},{"$error":"#REF!"},{"$f":"(Data!$M6+Beregning!$E$6*Data!$N6)","v":{"$error":"#REF!"}},{"$error":"#REF!"},{"$f":"(Data!$O6+Beregning!$E$6*Data!$P6)","v":{"$error":"#REF!"}},{"$f":"(B6/P6)","v":{"$error":"#REF!"}}]
["40mm - 6kg stripselodd",6,null,null,null,null,null,{"$f":"(Data!$G7+Beregning!$E$6*Data!$H7)","v":{"$error":"#REF!"}},{"$error":"#REF!"},{"$f":"(Data!$I7+Beregning!$E$6*Data!$J7)","v":{"$error":"#REF!"}},{"$error":"#REF!"},{"$f":"(Data!$K7+Beregning!$E$6*Data!$L7)","v":{"$error":"#REF!"}},{"$error":"#REF!"},{"$f":"(Data!$M7+Beregning!$E$6*Data!$N7)","v":{"$error":"#REF!"}},{"$error":"#REF!"},{"$f":"(Data!$O7+Beregning!$E$6*Data!$P7)","v":{"$error":"#REF!"}},{"$error":"#REF!"}]
["40mm - 8,5kg stripselodd",8.5,null,null,null,null,null,{"$f":"(Data!$G8+Beregning!$E$6*Data!$H8)","v":{"$error":"#REF!"}},{"$f":"(B8/H8)","v":{"$error":"#REF!"}},{"$f":"(Data!$I8+Beregning!$E$6*Data!$J8)","v":{"$error":"#REF!"}},{"$f":"(B8/J8)","v":{"$error":"#REF!"}},{"$f":"(Data!$K8+Beregning!$E$6*Data!$L8)","v":{"$error":"#REF!"}},{"$f":"(B8/L8)","v":{"$error":"#REF!"}},{"$f":"(Data!$M8+Beregning!$E$6*Data!$N8)","v":{"$error":"#REF!"}},{"$f":"(B8/N8)","v":{"$error":"#REF!"}},{"$f":"(Data!$O8+Beregning!$E$6*Data!$P8)","v":{"$error":"#REF!"}},{"$error":"#REF!"}]
["50mm - 4kg stripselodd",4,null,{"$f":"SUM(Data!$C9+Beregning!$E$6*Data!$D9)","v":{"$error":"#REF!"}},{"$f":"SUM(B9/D9)","v":{"$error":"#REF!"}},{"$f":"SUM(Data!$E9+Beregning!$E$6*Data!$F9)","v":{"$error":"#REF!"}},{"$f":"SUM(B9/F9)","v":{"$error":"#REF!"}},{"$f":"(Data!$G9+Beregning!$E$6*Data!$H9)","v":{"$error":"#REF!"}},{"$error":"#REF!"},{"$f":"(Data!$I9+Beregning!$E$6*Data!$J9)","v":{"$error":"#REF!"}},{"$error":"#REF!"},{"$f":"(Data!$K9+Beregning!$E$6*Data!$L9)","v":{"$error":"#REF!"}},{"$error":"#REF!"},{"$f":"(Data!$M9+Beregning!$E$6*Data!$N9)","v":{"$error":"#REF!"}},{"$error":"#REF!"},{"$f":"(Data!$O9+Beregning!$E$6*Data!$P9)","v":{"$error":"#REF!"}},{"$error":"#REF!"}]
["50mm - 6kg stripselodd",6,null,{"$f":"SUM(Data!$C10+Beregning!$E$6*Data!$D10)","v":{"$error":"#REF!"}},{"$error":"#REF!"},{"$f":"SUM(Data!$E10+Beregning!$E$6*Data!$F10)","v":{"$error":"#REF!"}},{"$f":"SUM(B10/F10)","v":{"$error":"#REF!"}},{"$f":"(Data!$G10+Beregning!$E$6*Data!$H10)","v":{"$error":"#REF!"}},{"$error":"#REF!"},{"$f":"(Data!$I10+Beregning!$E$6*Data!$J10)","v":{"$error":"#REF!"}},{"$error":"#REF!"},{"$f":"(Data!$K10+Beregning!$E$6*Data!$L10)","v":{"$error":"#REF!"}},{"$error":"#REF!"},{"$f":"(Data!$M10+Beregning!$E$6*Data!$N10)","v":{"$error":"#REF!"}},{"$error":"#REF!"},{"$f":"(Data!$O10+Beregning!$E$6*Data!$P10)","v":{"$error":"#REF!"}},{"$error":"#REF!"}]
{"$rows_left_out":48}
{"sheet":"Data","index":3,"n_rows":38,"n_cols":16,"rows_kept":38,"cut":false,"hidden":false,"merged":[[0,14,0,15],[0,2,0,3],[0,4,0,5],[0,6,0,7],[0,8,0,9],[0,10,0,11],[0,12,0,13]]}
["SDR",null,26,null,21,null,17,null,13.6,null,11,null,9,null,7.4]
[]
["Størrelse","vekt i kg"," "," "," "," "," "," "," "," "," "," "," "," "]
[]
[32,4,null,null,null,null,{"$f":"INDEX(INDIRECT(Lister!$Q$4),MATCH($A5,INDIRECT(Lister!$Q$4&\"!$A:$A\"),0),MATCH(G$1,INDIRECT(Lister!$Q$4&\"!$2:$2\"),0))","v":{"$error":"#REF!"}},{"$f":"INDEX(INDIRECT(Lister!$Q$4),MATCH($A5,INDIRECT(Lister!$Q$4&\"!$A:$A\"),0),MATCH(G$1&\"l\",INDIRECT(Lister!$Q$4&\"!$2:$2\"),0))","v":{"$error":"#REF!"}},{"$f":"INDEX(INDIRECT(Lister!$Q$4),MATCH($A5,INDIRECT(Lister!$Q$4&\"!$A:$A\"),0),MATCH(I$1,INDIRECT(Lister!$Q$4&\"!$2:$2\"),0))","v":{"$error":"#REF!"}},{"$f":"INDEX(INDIRECT(Lister!$Q$4),MATCH($A5,INDIRECT(Lister!$Q$4&\"!$A:$A\"),0),MATCH(I$1&\"l\",INDIRECT(Lister!$Q$4&\"!$2:$2\"),0))","v":{"$error":"#REF!"}},{"$f":"INDEX(INDIRECT(Lister!$Q$4),MATCH($A5,INDIRECT(Lister!$Q$4&\"!$A:$A\"),0),MATCH(K$1,INDIRECT(Lister!$Q$4&\"!$2:$2\"),0))","v":{"$error":"#REF!"}},{"$f":"INDEX(INDIRECT(Lister!$Q$4),MATCH($A5,INDIRECT(Lister!$Q$4&\"!$A:$A\"),0),MATCH(K$1&\"l\",INDIRECT(Lister!$Q$4&\"!$2:$2\"),0))","v":{"$error":"#REF!"}},{"$f":"INDEX(INDIRECT(Lister!$Q$4),MATCH($A5,INDIRECT(Lister!$Q$4&\"!$A:$A\"),0),MATCH(M$1,INDIRECT(Lister!$Q$4&\"!$2:$2\"),0))","v":{"$error":"#REF!"}},{"$f":"INDEX(INDIRECT(Lister!$Q$4),MATCH($A5,INDIRECT(Lister!$Q$4&\"!$A:$A\"),0),MATCH(M$1&\"l\",INDIRECT(Lister!$Q$4&\"!$2:$2\"),0))","v":{"$error":"#REF!"}},{"$f":"INDEX(INDIRECT(Lister!$Q$4),MATCH($A5,INDIRECT(Lister!$Q$4&\"!$A:$A\"),0),MATCH(O$1,INDIRECT(Lister!$Q$4&\"!$2:$2\"),0))","v":{"$error":"#REF!"}},{"$f":"INDEX(INDIRECT(Lister!$Q$4),MATCH($A5,INDIRECT(Lister!$Q$4&\"!$A:$A\"),0),MATCH(O$1&\"l\",INDIRECT(Lister!$Q$4&\"!$2:$2\"),0))","v":{"$error":"#REF!"}}]
[40,4,null,null,{"$f":"INDEX(INDIRECT(Lister!$Q$4),MATCH($A6,INDIRECT(Lister!$Q$4&\"!$A:$A\"),0),MATCH(E$1,INDIRECT(Lister!$Q$4&\"!$2:$2\"),0))","v":{"$error":"#REF!"}},{"$f":"INDEX(INDIRECT(Lister!$Q$4),MATCH($A6,INDIRECT(Lister!$Q$4&\"!$A:$A\"),0),MATCH(E$1&\"l\",INDIRECT(Lister!$Q$4&\"!$2:$2\"),0))","v":{"$error":"#REF!"}},{"$f":"INDEX(INDIRECT(Lister!$Q$4),MATCH($A6,INDIRECT(Lister!$Q$4&\"!$A:$A\"),0),MATCH(G$1,INDIRECT(Lister!$Q$4&\"!$2:$2\"),0))","v":{"$error":"#REF!"}},{"$f":"INDEX(INDIRECT(Lister!$Q$4),MATCH($A6,INDIRECT(Lister!$Q$4&\"!$A:$A\"),0),MATCH(G$1&\"l\",INDIRECT(Lister!$Q$4&\"!$2:$2\"),0))","v":{"$error":"#REF!"}},{"$f":"INDEX(INDIRECT(Lister!$Q$4),MATCH($A6,INDIRECT(Lister!$Q$4&\"!$A:$A\"),0),MATCH(I$1,INDIRECT(Lister!$Q$4&\"!$2:$2\"),0))","v":{"$error":"#REF!"}},{"$f":"INDEX(INDIRECT(Lister!$Q$4),MATCH($A6,INDIRECT(Lister!$Q$4&\"!$A:$A\"),0),MATCH(I$1&\"l\",INDIRECT(Lister!$Q$4&\"!$2:$2\"),0))","v":{"$error":"#REF!"}},{"$f":"INDEX(INDIRECT(Lister!$Q$4),MATCH($A6,INDIRECT(Lister!$Q$4&\"!$A:$A\"),0),MATCH(K$1,INDIRECT(Lister!$Q$4&\"!$2:$2\"),0))","v":{"$error":"#REF!"}},{"$f":"INDEX(INDIRECT(Lister!$Q$4),MATCH($A6,INDIRECT(Lister!$Q$4&\"!$A:$A\"),0),MATCH(K$1&\"l\",INDIRECT(Lister!$Q$4&\"!$2:$2\"),0))","v":{"$error":"#REF!"}},{"$f":"INDEX(INDIRECT(Lister!$Q$4),MATCH($A6,INDIRECT(Lister!$Q$4&\"!$A:$A\"),0),MATCH(M$1,INDIRECT(Lister!$Q$4&\"!$2:$2\"),0))","v":{"$error":"#REF!"}},{"$f":"INDEX(INDIRECT(Lister!$Q$4),MATCH($A6,INDIRECT(Lister!$Q$4&\"!$A:$A\"),0),MATCH(M$1&\"l\",INDIRECT(Lister!$Q$4&\"!$2:$2\"),0))","v":{"$error":"#REF!"}},{"$f":"INDEX(INDIRECT(Lister!$Q$4),MATCH($A6,INDIRECT(Lister!$Q$4&\"!$A:$A\"),0),MATCH(O$1,INDIRECT(Lister!$Q$4&\"!$2:$2\"),0))","v":{"$error":"#REF!"}},{"$f":"INDEX(INDIRECT(Lister!$Q$4),MATCH($A6,INDIRECT(Lister!$Q$4&\"!$A:$A\"),0),MATCH(O$1&\"l\",INDIRECT(Lister!$Q$4&\"!$2:$2\"),0))","v":{"$error":"#REF!"}}]
[40,6,null,null,{"$f":"INDEX(INDIRECT(Lister!$Q$4),MATCH($A7,INDIRECT(Lister!$Q$4&\"!$A:$A\"),0),MATCH(E$1,INDIRECT(Lister!$Q$4&\"!$2:$2\"),0))","v":{"$error":"#REF!"}},{"$f":"INDEX(INDIRECT(Lister!$Q$4),MATCH($A7,INDIRECT(Lister!$Q$4&\"!$A:$A\"),0),MATCH(E$1&\"l\",INDIRECT(Lister!$Q$4&\"!$2:$2\"),0))","v":{"$error":"#REF!"}},{"$f":"INDEX(INDIRECT(Lister!$Q$4),MATCH($A7,INDIRECT(Lister!$Q$4&\"!$A:$A\"),0),MATCH(G$1,INDIRECT(Lister!$Q$4&\"!$2:$2\"),0))","v":{"$error":"#REF!"}},{"$f":"INDEX(INDIRECT(Lister!$Q$4),MATCH($A7,INDIRECT(Lister!$Q$4&\"!$A:$A\"),0),MATCH(G$1&\"l\",INDIRECT(Lister!$Q$4&\"!$2:$2\"),0))","v":{"$error":"#REF!"}},{"$f":"INDEX(INDIRECT(Lister!$Q$4),MATCH($A7,INDIRECT(Lister!$Q$4&\"!$A:$A\"),0),MATCH(I$1,INDIRECT(Lister!$Q$4&\"!$2:$2\"),0))","v":{"$error":"#REF!"}},{"$f":"INDEX(INDIRECT(Lister!$Q$4),MATCH($A7,INDIRECT(Lister!$Q$4&\"!$A:$A\"),0),MATCH(I$1&\"l\",INDIRECT(Lister!$Q$4&\"!$2:$2\"),0))","v":{"$error":"#REF!"}},{"$f":"INDEX(INDIRECT(Lister!$Q$4),MATCH($A7,INDIRECT(Lister!$Q$4&\"!$A:$A\"),0),MATCH(K$1,INDIRECT(Lister!$Q$4&\"!$2:$2\"),0))","v":{"$error":"#REF!"}},{"$f":"INDEX(INDIRECT(Lister!$Q$4),MATCH($A7,INDIRECT(Lister!$Q$4&\"!$A:$A\"),0),MATCH(K$1&\"l\",INDIRECT(Lister!$Q$4&\"!$2:$2\"),0))","v":{"$error":"#REF!"}},{"$f":"INDEX(INDIRECT(Lister!$Q$4),MATCH($A7,INDIRECT(Lister!$Q$4&\"!$A:$A\"),0),MATCH(M$1,INDIRECT(Lister!$Q$4&\"!$2:$2\"),0))","v":{"$error":"#REF!"}},{"$f":"INDEX(INDIRECT(Lister!$Q$4),MATCH($A7,INDIRECT(Lister!$Q$4&\"!$A:$A\"),0),MATCH(M$1&\"l\",INDIRECT(Lister!$Q$4&\"!$2:$2\"),0))","v":{"$error":"#REF!"}},{"$f":"INDEX(INDIRECT(Lister!$Q$4),MATCH($A7,INDIRECT(Lister!$Q$4&\"!$A:$A\"),0),MATCH(O$1,INDIRECT(Lister!$Q$4&\"!$2:$2\"),0))","v":{"$error":"#REF!"}},{"$f":"INDEX(INDIRECT(Lister!$Q$4),MATCH($A7,INDIRECT(Lister!$Q$4&\"!$A:$A\"),0),MATCH(O$1&\"l\",INDIRECT(Lister!$Q$4&\"!$2:$2\"),0))","v":{"$error":"#REF!"}}]
[40,8.5,null,null,{"$f":"INDEX(INDIRECT(Lister!$Q$4),MATCH($A8,INDIRECT(Lister!$Q$4&\"!$A:$A\"),0),MATCH(E$1,INDIRECT(Lister!$Q$4&\"!$2:$2\"),0))","v":{"$error":"#REF!"}},{"$f":"INDEX(INDIRECT(Lister!$Q$4),MATCH($A8,INDIRECT(Lister!$Q$4&\"!$A:$A\"),0),MATCH(E$1&\"l\",INDIRECT(Lister!$Q$4&\"!$2:$2\"),0))","v":{"$error":"#REF!"}},{"$f":"INDEX(INDIRECT(Lister!$Q$4),MATCH($A8,INDIRECT(Lister!$Q$4&\"!$A:$A\"),0),MATCH(G$1,INDIRECT(Lister!$Q$4&\"!$2:$2\"),0))","v":{"$error":"#REF!"}},{"$f":"INDEX(INDIRECT(Lister!$Q$4),MATCH($A8,INDIRECT(Lister!$Q$4&\"!$A:$A\"),0),MATCH(G$1&\"l\",INDIRECT(Lister!$Q$4&\"!$2:$2\"),0))","v":{"$error":"#REF!"}},{"$f":"INDEX(INDIRECT(Lister!$Q$4),MATCH($A8,INDIRECT(Lister!$Q$4&\"!$A:$A\"),0),MATCH(I$1,INDIRECT(Lister!$Q$4&\"!$2:$2\"),0))","v":{"$error":"#REF!"}},{"$f":"INDEX(INDIRECT(Lister!$Q$4),MATCH($A8,INDIRECT(Lister!$Q$4&\"!$A:$A\"),0),MATCH(I$1&\"l\",INDIRECT(Lister!$Q$4&\"!$2:$2\"),0))","v":{"$error":"#REF!"}},{"$f":"INDEX(INDIRECT(Lister!$Q$4),MATCH($A8,INDIRECT(Lister!$Q$4&\"!$A:$A\"),0),MATCH(K$1,INDIRECT(Lister!$Q$4&\"!$2:$2\"),0))","v":{"$error":"#REF!"}},{"$f":"INDEX(INDIRECT(Lister!$Q$4),MATCH($A8,INDIRECT(Lister!$Q$4&\"!$A:$A\"),0),MATCH(K$1&\"l\",INDIRECT(Lister!$Q$4&\"!$2:$2\"),0))","v":{"$error":"#REF!"}},{"$f":"INDEX(INDIRECT(Lister!$Q$4),MATCH($A8,INDIRECT(Lister!$Q$4&\"!$A:$A\"),0),MATCH(M$1,INDIRECT(Lister!$Q$4&\"!$2:$2\"),0))","v":{"$error":"#REF!"}},{"$f":"INDEX(INDIRECT(Lister!$Q$4),MATCH($A8,INDIRECT(Lister!$Q$4&\"!$A:$A\"),0),MATCH(M$1&\"l\",INDIRECT(Lister!$Q$4&\"!$2:$2\"),0))","v":{"$error":"#REF!"}},{"$f":"INDEX(INDIRECT(Lister!$Q$4),MATCH($A8,INDIRECT(Lister!$Q$4&\"!$A:$A\"),0),MATCH(O$1,INDIRECT(Lister!$Q$4&\"!$2:$2\"),0))","v":{"$error":"#REF!"}},{"$f":"INDEX(INDIRECT(Lister!$Q$4),MATCH($A8,INDIRECT(Lister!$Q$4&\"!$A:$A\"),0),MATCH(O$1&\"l\",INDIRECT(Lister!$Q$4&\"!$2:$2\"),0))","v":{"$error":"#REF!"}}]
[50,4,{"$f":"INDEX(INDIRECT(Lister!$Q$4),MATCH($A9,INDIRECT(Lister!$Q$4&\"!$A:$A\"),0),MATCH(C$1,INDIRECT(Lister!$Q$4&\"!$2:$2\"),0))","v":{"$error":"#REF!"}},{"$f":"INDEX(INDIRECT(Lister!$Q$4),MATCH($A9,INDIRECT(Lister!$Q$4&\"!$A:$A\"),0),MATCH(C$1&\"l\",INDIRECT(Lister!$Q$4&\"!$2:$2\"),0))","v":{"$error":"#REF!"}},{"$f":"INDEX(INDIRECT(Lister!$Q$4),MATCH($A9,INDIRECT(Lister!$Q$4&\"!$A:$A\"),0),MATCH(E$1,INDIRECT(Lister!$Q$4&\"!$2:$2\"),0))","v":{"$error":"#REF!"}},{"$f":"INDEX(INDIRECT(Lister!$Q$4),MATCH($A9,INDIRECT(Lister!$Q$4&\"!$A:$A\"),0),MATCH(E$1&\"l\",INDIRECT(Lister!$Q$4&\"!$2:$2\"),0))","v":{"$error":"#REF!"}},{"$f":"INDEX(INDIRECT(Lister!$Q$4),MATCH($A9,INDIRECT(Lister!$Q$4&\"!$A:$A\"),0),MATCH(G$1,INDIRECT(Lister!$Q$4&\"!$2:$2\"),0))","v":{"$error":"#REF!"}},{"$f":"INDEX(INDIRECT(Lister!$Q$4),MATCH($A9,INDIRECT(Lister!$Q$4&\"!$A:$A\"),0),MATCH(G$1&\"l\",INDIRECT(Lister!$Q$4&\"!$2:$2\"),0))","v":{"$error":"#REF!"}},{"$f":"INDEX(INDIRECT(Lister!$Q$4),MATCH($A9,INDIRECT(Lister!$Q$4&\"!$A:$A\"),0),MATCH(I$1,INDIRECT(Lister!$Q$4&\"!$2:$2\"),0))","v":{"$error":"#REF!"}},{"$f":"INDEX(INDIRECT(Lister!$Q$4),MATCH($A9,INDIRECT(Lister!$Q$4&\"!$A:$A\"),0),MATCH(I$1&\"l\",INDIRECT(Lister!$Q$4&\"!$2:$2\"),0))","v":{"$error":"#REF!"}},{"$f":"INDEX(INDIRECT(Lister!$Q$4),MATCH($A9,INDIRECT(Lister!$Q$4&\"!$A:$A\"),0),MATCH(K$1,INDIRECT(Lister!$Q$4&\"!$2:$2\"),0))","v":{"$error":"#REF!"}},{"$f":"INDEX(INDIRECT(Lister!$Q$4),MATCH($A9,INDIRECT(Lister!$Q$4&\"!$A:$A\"),0),MATCH(K$1&\"l\",INDIRECT(Lister!$Q$4&\"!$2:$2\"),0))","v":{"$error":"#REF!"}},{"$f":"INDEX(INDIRECT(Lister!$Q$4),MATCH($A9,INDIRECT(Lister!$Q$4&\"!$A:$A\"),0),MATCH(M$1,INDIRECT(Lister!$Q$4&\"!$2:$2\"),0))","v":{"$error":"#REF!"}},{"$f":"INDEX(INDIRECT(Lister!$Q$4),MATCH($A9,INDIRECT(Lister!$Q$4&\"!$A:$A\"),0),MATCH(M$1&\"l\",INDIRECT(Lister!$Q$4&\"!$2:$2\"),0))","v":{"$error":"#REF!"}},{"$f":"INDEX(INDIRECT(Lister!$Q$4),MATCH($A9,INDIRECT(Lister!$Q$4&\"!$A:$A\"),0),MATCH(O$1,INDIRECT(Lister!$Q$4&\"!$2:$2\"),0))","v":{"$error":"#REF!"}},{"$f":"INDEX(INDIRECT(Lister!$Q$4),MATCH($A9,INDIRECT(Lister!$Q$4&\"!$A:$A\"),0),MATCH(O$1&\"l\",INDIRECT(Lister!$Q$4&\"!$2:$2\"),0))","v":{"$error":"#REF!"}}]
[50,6,{"$f":"INDEX(INDIRECT(Lister!$Q$4),MATCH($A10,INDIRECT(Lister!$Q$4&\"!$A:$A\"),0),MATCH(C$1,INDIRECT(Lister!$Q$4&\"!$2:$2\"),0))","v":{"$error":"#REF!"}},{"$f":"INDEX(INDIRECT(Lister!$Q$4),MATCH($A10,INDIRECT(Lister!$Q$4&\"!$A:$A\"),0),MATCH(C$1&\"l\",INDIRECT(Lister!$Q$4&\"!$2:$2\"),0))","v":{"$error":"#REF!"}},{"$f":"INDEX(INDIRECT(Lister!$Q$4),MATCH($A10,INDIRECT(Lister!$Q$4&\"!$A:$A\"),0),MATCH(E$1,INDIRECT(Lister!$Q$4&\"!$2:$2\"),0))","v":{"$error":"#REF!"}},{"$f":"INDEX(INDIRECT(Lister!$Q$4),MATCH($A10,INDIRECT(Lister!$Q$4&\"!$A:$A\"),0),MATCH(E$1&\"l\",INDIRECT(Lister!$Q$4&\"!$2:$2\"),0))","v":{"$error":"#REF!"}},{"$f":"INDEX(INDIRECT(Lister!$Q$4),MATCH($A10,INDIRECT(Lister!$Q$4&\"!$A:$A\"),0),MATCH(G$1,INDIRECT(Lister!$Q$4&\"!$2:$2\"),0))","v":{"$error":"#REF!"}},{"$f":"INDEX(INDIRECT(Lister!$Q$4),MATCH($A10,INDIRECT(Lister!$Q$4&\"!$A:$A\"),0),MATCH(G$1&\"l\",INDIRECT(Lister!$Q$4&\"!$2:$2\"),0))","v":{"$error":"#REF!"}},{"$f":"INDEX(INDIRECT(Lister!$Q$4),MATCH($A10,INDIRECT(Lister!$Q$4&\"!$A:$A\"),0),MATCH(I$1,INDIRECT(Lister!$Q$4&\"!$2:$2\"),0))","v":{"$error":"#REF!"}},{"$f":"INDEX(INDIRECT(Lister!$Q$4),MATCH($A10,INDIRECT(Lister!$Q$4&\"!$A:$A\"),0),MATCH(I$1&\"l\",INDIRECT(Lister!$Q$4&\"!$2:$2\"),0))","v":{"$error":"#REF!"}},{"$f":"INDEX(INDIRECT(Lister!$Q$4),MATCH($A10,INDIRECT(Lister!$Q$4&\"!$A:$A\"),0),MATCH(K$1,INDIRECT(Lister!$Q$4&\"!$2:$2\"),0))","v":{"$error":"#REF!"}},{"$f":"INDEX(INDIRECT(Lister!$Q$4),MATCH($A10,INDIRECT(Lister!$Q$4&\"!$A:$A\"),0),MATCH(K$1&\"l\",INDIRECT(Lister!$Q$4&\"!$2:$2\"),0))","v":{"$error":"#REF!"}},{"$f":"INDEX(INDIRECT(Lister!$Q$4),MATCH($A10,INDIRECT(Lister!$Q$4&\"!$A:$A\"),0),MATCH(M$1,INDIRECT(Lister!$Q$4&\"!$2:$2\"),0))","v":{"$error":"#REF!"}},{"$f":"INDEX(INDIRECT(Lister!$Q$4),MATCH($A10,INDIRECT(Lister!$Q$4&\"!$A:$A\"),0),MATCH(M$1&\"l\",INDIRECT(Lister!$Q$4&\"!$2:$2\"),0))","v":{"$error":"#REF!"}},{"$f":"INDEX(INDIRECT(Lister!$Q$4),MATCH($A10,INDIRECT(Lister!$Q$4&\"!$A:$A\"),0),MATCH(O$1,INDIRECT(Lister!$Q$4&\"!$2:$2\"),0))","v":{"$error":"#REF!"}},{"$f":"INDEX(INDIRECT(Lister!$Q$4),MATCH($A10,INDIRECT(Lister!$Q$4&\"!$A:$A\"),0),MATCH(O$1&\"l\",INDIRECT(Lister!$Q$4&\"!$2:$2\"),0))","v":{"$error":"#REF!"}}]
{"$rows_left_out":29}
{"sheet":"Endring","index":4,"n_rows":5,"n_cols":6,"rows_kept":5,"cut":false,"hidden":false,"merged":[[4,1,4,4]]}
["Endringslogg:"]
["Dato:","Hendelse:"]
["2013-08-12","Endret vekt på 200mm lodd til 90 kg. Endring i fane:\"Data\" og \"Data2\""]
["2014-03-11","Lagt inn stripselodd 8,5 kg"]
["2022-03-25","Skiftet vekt på Ø560 loddet fra 900kg til 830kg",null,null,null,"RG"]

{"sheet":"Ferskvann","index":5,"n_rows":39,"n_cols":15,"rows_kept":39,"cut":false,"hidden":true,"merged":[]}
["DN/OD","SDR","SDR","SDR","SDR","SDR","SDR","SDR","SDR","SDR","SDR","SDR","SDR","SDR","SDR"]
[null,26,"26l",21,"21l",17,"17l",13.6,"13,6l",11,"11l",9,"9l",7.4,"7,4l"]
[20,null,null,null,null,null,null,null,null,-0.01,0.34,-0.01,0.32,-0.01,0.26]
[25,null,null,null,null,null,null,-0.01,0.59,-0.01,0.56000000000000005,-0.01,0.48,-0.01,0.44]
[32,null,null,null,null,-0.02,1.05,-0.01,0.99,0,0.91,-0.01,0.83,-0.01,0.72]
[40,null,null,-0.02,1.74,-0.01,1.66,-0.01,1.55,-0.02,1.43,-0.01,1.29,-0.02,1.1299999999999999]
[50,-0.03,2.84,-0.02,2.74,-0.03,2.6,-0.02,2.44,-0.03,2.2400000000000002,-0.01,2.02,-0.02,1.76]
[63,-0.01,4.5199999999999996,-0.04,4.3600000000000003,-0.04,4.12,-0.01,3.86,-0.03,3.55,-0.01,3.2,-0.05,2.82]
[75,-0.04,6.43,-0.03,6.17,-0.06,5.85,-0.02,5.47,-0.04,5.0599999999999996,-0.02,4.55,-0.03,3.97]
[90,-0.06,9.25,-0.06,8.9,-0.06,8.42,-0.01,7.88,-0.06,7.28,-0.01,6.54,-0.06,5.74]
{"$rows_left_out":30}
{"sheet":"Fjord","index":6,"n_rows":39,"n_cols":15,"rows_kept":39,"cut":false,"hidden":true,"merged":[]}
["DN/OD","SDR","SDR","SDR","SDR","SDR","SDR","SDR","SDR","SDR","SDR","SDR","SDR","SDR","SDR"]
[null,26,"26l",21,"21l",17,"17l",13.6,"13,6l",11,"11l",9,"9l",7.4,"7,4l"]
[20,null,null,null,null,null,null,null,null,0.01,0.35,0,0.33,0.01,0.27]
[25,null,null,null,null,null,null,0.01,0.61,0.01,0.56999999999999995,0.01,0.5,0.01,0.45]
[32,null,null,null,null,0.02,1.08,0.03,1.02,0.03,0.93,0.03,0.85,0.03,0.74]
[40,null,null,0.03,1.78,0.04,1.7,0.05,1.59,0.03,1.46,0.05,1.32,0.04,1.1599999999999999]
[50,0.06,2.91,0.06,2.81,0.06,2.66,7.0000000000000007E-2,2.4900000000000002,0.06,2.29,7.0000000000000007E-2,2.0699999999999998,7.0000000000000007E-2,1.8]
[63,0.12,4.62,0.1,4.47,0.1,4.22,0.12,3.95,0.11,3.63,0.13,3.27,0.08,2.88]
[75,0.15,6.58,0.16,6.32,0.13,5.99,0.18,5.59,0.15,5.18,0.17,4.66,0.16,4.07]
[90,0.22,9.4700000000000006,0.22,9.11,0.22,8.6199999999999992,0.27,8.06,0.22,7.45,0.27,6.7,0.21,5.88]
{"$rows_left_out":30}
{"sheet":"Hav","index":7,"n_rows":39,"n_cols":15,"rows_kept":39,"cut":false,"hidden":true,"merged":[]}
["DN/OD","SDR","SDR","SDR","SDR","SDR","SDR","SDR","SDR","SDR","SDR","SDR","SDR","SDR","SDR"]
[null,26,"26l",21,"21l",17,"17l",13.6,"13,6l",11,"11l",9,"9l",7.4,"7,4l"]
[20,null,null,null,null,null,null,null,null,0.01,0.35,0.01,0.33,0.01,0.27]
[25,null,null,null,null,null,null,0.02,0.61,0.02,0.57999999999999996,0.02,0.5,0.02,0.45]
[32,null,null,null,null,0.03,1.08,0.04,1.02,0.05,0.93,0.04,0.85,0.04,0.74]
[40,null,null,0.06,1.79,7.0000000000000007E-2,1.71,7.0000000000000007E-2,1.6,0.06,1.47,7.0000000000000007E-2,1.33,0.06,1.1599999999999999]
[50,0.09,2.92,0.1,2.82,0.09,2.68,0.1,2.5099999999999998,0.09,2.2999999999999998,0.11,2.08,0.1,1.81]
[63,0.18,4.6500000000000004,0.16,4.49,0.15,4.24,0.18,3.97,0.16,3.65,0.19,3.29,0.14000000000000001,2.9]
[75,0.23,6.62,0.24,6.35,0.21,6.02,0.26,5.63,0.23,5.21,0.25,4.68,0.24,4.09]
[90,0.33,9.52,0.34,9.16,0.33,8.67,0.38,8.11,0.33,7.49,0.38,6.73,0.33,5.91]
{"$rows_left_out":29}